�{�ݐ�������,���ݒn,�⑫���ݒn,�X�֔ԍ�,�d�b�ԍ�,�J�ݔN����,�J�ݎҖ�,�Ǘ��Ҏ���,��ʕa����,�×{�a����,���_�a����,���j�a����,�����Ǖa����,����,�ċz���,�������,�ݒ���,�z���,������,���_��,�_�o��,�_�o����,�O��,���`�O��,�`���O��,���e�O��,�]�_�o�O��,�ċz��O��,�S�����ǊO��,�����O��,�Y�w�l��,�Y��,�w�l��,���,���@���񂱂���,�C�ǐH����,�畆�ДA���,�畆��,�ДA���,���a��,�������,���n�r���e�[�V������,���ː���,������,����,��������,��������,�S�Ó���,���Ȍ��o�O��,�A�����M�[��,���E�}�`��,�ċz�����,�z�����,���������,�t������,���A�a����,���t����,������O��,�����Ǔ���,�z��O��,���B�O��,�C�ǐH���O��,���O��,�a���f�f��,�Տ�������,�~�}��,�f�ÉȖڂ��̑�
��Ö@�l�L�i��  �V��i�a�@,�k��B�s��i��,�厚����U�P�T�Ԓn,800-0102,481-1368,1966/10/1,��Ö@�l�@�L�i��,����@�L��Y,,,260,,,1,0,0,0,0,0,1,0,1,0,0,0,0,0,0,0,0,0,0,0,0,0,0,0,0,0,0,0,1,0,0,0,0,0,0,0,0,0,0,0,0,0,0,0,0,0,0,0,0,0,0,0,0,
��i�����]�a�@,�k��B�s��i��,�厚���R�T�T�Ԓn,800-0112,481-1281,1983/1/27,��Ö@�l�@�Вc���a��@,�R�Y�@�q�G,,,192,,,1,0,0,0,0,0,1,0,0,0,0,0,0,0,0,0,0,0,0,0,0,0,0,0,0,0,0,0,0,0,0,0,0,0,1,0,0,0,0,0,0,0,0,0,0,0,0,0,0,0,0,0,0,�V�N����
�k��B�s����i�a�@,�k��B�s��i��,��{���R�ԂP��,800-0021,381-3581,1963/2/10,�k��B�s,�A���@��V,50,50,,55,,1,0,0,0,0,1,0,0,1,1,1,0,0,0,0,0,0,0,0,0,1,0,0,0,1,1,0,0,1,1,0,0,0,0,0,0,0,0,1,1,1,0,0,1,0,0,0,0,0,0,0,0,0,
���v�Вc�@�l���{�C���t�ω�@��i�t�ω�a�@,�k��B�s��i��,����꒚�ڂR�ԂP��,801-0833,321-0984,1921/9/9,���v�Вc�@�l���{�C���t�ω�,����@����Y,199,,,,,1,0,0,0,0,0,0,0,0,1,1,0,0,0,0,0,0,0,0,1,1,1,0,0,1,1,0,0,1,1,1,1,0,0,0,1,0,0,0,1,1,1,1,0,1,0,0,0,0,0,0,0,0,�]�_�o����
��i�c��Y�a�@,�k��B�s��i��,�厚�c��Y�P�O�P�W�Ԓn�̂P,801-0803,331-0800,1968/12/25,��Ö@�l�@�ɐ���,�㓡�@��v,,45,384,,,1,0,0,0,0,0,1,0,0,0,0,0,0,0,0,0,0,0,0,0,0,0,0,0,0,0,0,0,0,0,0,0,0,0,1,0,0,0,0,0,0,0,0,0,0,0,0,0,0,0,0,0,0,
��Ö@�l�Вc�{����  �t���a�@,�k��B�s��i��,�t�����Q�Q�ԂP�X��,801-0823,341-1416,1969/10/16,��Ö@�l�Вc�@�{����,�ؑ��@���F,56,96,,,,1,0,0,0,0,0,0,0,0,0,0,0,0,0,0,0,0,0,0,0,0,0,0,0,0,0,0,0,1,1,0,0,0,0,0,0,0,0,0,1,0,0,0,0,0,0,0,0,0,0,0,0,0,
�����a�@,�k��B�s��i��,�g�u�ܒ��ڂT�ԂP�O��,800-0114,481-1831,1991/9/1,��Ö@�l�Вc�@�����a�@,����@�B��,,48,,,,1,0,0,0,0,0,1,0,0,0,0,0,0,0,0,0,0,0,0,0,0,0,0,0,0,0,0,0,1,0,0,0,0,0,0,0,0,0,0,1,0,0,0,0,0,0,0,0,0,0,0,0,0,
��Ö@�l�Вc����  �΃P�u�a�@,�k��B�s��i��,�΃P�u�R�ԂT��,800-0043,381-5903,1973/2/10,��Ö@�l�Вc����,�O�c�@�M�q,54,50,,,,1,1,1,0,1,0,0,0,0,0,0,0,0,0,0,0,0,0,0,0,0,0,0,0,0,0,0,0,1,0,0,0,0,0,0,0,0,0,0,0,0,0,0,0,0,0,0,0,0,0,0,0,0,
�Ɨ��s���@�l�J���Ҍ��N���S�@�\��B�J�Еa�@��i���f�B�J���Z���^�[,�k��B�s��i��,���`���R�ԂP��,801-0853,331-3461,1989/12/1,�Ɨ��s���@�l�J���Ҍ��N���S�@�\,�����@���T,187,,,,,1,0,0,0,0,0,0,0,0,1,1,0,0,1,0,0,0,0,0,0,1,0,0,0,1,1,0,0,1,1,1,1,0,0,0,0,0,0,0,1,1,0,0,0,0,0,0,0,0,0,0,0,0,�]�_�o����
�����a�@,�k��B�s���q�k��,�����O���ڂR�ԂR�Q��,803-0831,581-0012,1953/12/5,��Ö@�l�@������,�k���@����,,,320,,,1,0,0,0,0,0,1,1,0,0,0,0,0,0,0,0,0,0,0,0,0,0,0,0,0,0,0,0,0,0,0,0,0,0,0,0,0,0,0,0,0,0,0,0,0,0,0,0,0,0,0,0,0,
���ƌ��������ϑg���A����@�V���q�a�@,�k��B�s���q�k��,���c�꒚�ڂR�ԂP��,803-0816,571-1031,1965/5/25,���ƌ��������ϑg���A����,�˖{�@�_,259,41,,,,1,0,0,0,0,0,0,0,0,1,1,0,0,0,1,0,0,0,0,1,1,0,0,0,1,1,0,0,1,1,1,0,0,0,0,1,0,1,1,1,1,0,0,1,1,1,0,0,0,0,0,0,0,�]�_�o���� �̑��O�� ���A�a��������� �V�N���� �̑�����
���q����a�@,�k��B�s���q�k��,����ܒ��ڂP�P�ԂW��,803-0836,581-0181,1957/9/1,��Ö@�l�@�щ�,�����@�N��,58,107,,,,1,0,0,0,0,0,1,0,0,1,1,0,0,1,0,0,0,0,0,1,0,1,0,0,1,1,0,0,1,1,0,0,0,0,1,0,0,0,0,0,0,0,0,0,0,0,0,0,0,0,0,0,0,
�샖�u�a�@,�k��B�s���q�k��,�����O���ڂP�R�ԂP��,803-0862,571-6081,1963/10/23,��Ö@�l�@���ˉ�,�����@����,,64,256,,,1,0,0,0,0,0,1,0,0,0,0,0,0,0,0,0,0,0,0,0,0,0,0,0,0,0,0,0,1,0,0,0,0,0,1,0,0,0,0,0,0,0,0,0,0,0,0,0,0,0,0,0,0,
�O����a�@,�k��B�s���q�k��,�O����꒚�ڂP�Q�ԂP�W��,802-0065,931-7931,1964/10/24,���v���c�@�l�@���q��Ë���,�≺�@�r��,181,,,,,1,1,0,1,1,0,0,0,1,1,1,0,0,0,0,0,0,0,0,0,0,0,0,0,0,1,0,0,1,1,0,0,0,0,1,0,0,0,0,0,0,0,0,0,0,0,0,0,0,0,0,0,0,
���q���n�r���e�[�V�����a�@,�k��B�s���q�k��,��꒚�ڂT�ԂP��,803-0861,581-0668,1973/2/1,��Ö@�l�@���a��,�~�Á@�S��,40,158,,,,1,0,0,0,0,0,0,0,1,0,1,0,0,0,0,0,0,0,0,0,0,0,0,0,1,0,0,0,1,0,0,1,0,0,0,0,0,0,0,0,0,0,0,0,0,0,0,0,0,0,0,0,0,
���q�����a�@,�k��B�s���q���,�����ܒ��ڂT�ԂP��,802-0978,961-3238,1958/6/1,��Ö@�l�@���q�����a�@,�쐣�@��,,,254,,,0,0,0,0,0,0,1,0,1,0,0,0,0,0,0,0,0,0,0,0,0,0,0,0,0,0,0,0,0,0,0,0,0,0,0,0,0,0,0,0,0,0,0,0,0,0,0,0,0,0,0,0,0,
�����Ö@�l�V�b��@�����a�@,�k��B�s���q���,���������꒚�ڂQ�ԂR�O��,800-0252,471-7721,1985/1/1,�����Ö@�l�@�V�b��,�����@�T�v,,,326,,,1,0,0,0,0,0,1,0,0,0,0,0,0,0,0,0,0,0,0,0,0,0,0,0,0,0,0,0,0,0,0,0,0,0,0,0,0,0,0,0,0,0,0,0,0,0,0,0,0,0,0,0,0,
��Ö@�l���N��@�珬�q�a�@,�k��B�s���q���,�厚�x�z�R�T�W�Ԓn,802-0835,962-1950,1992/1/1,��Ö@�l�@���N��,��@�N��,,,310,,,1,0,0,0,0,0,1,1,0,0,0,0,0,0,0,0,0,0,0,0,0,0,0,0,0,0,0,0,0,0,0,0,0,0,0,0,0,0,0,0,0,0,0,0,0,0,0,0,0,0,0,0,0,
�Ɨ��s���@�l�����a�@�@�\���q��ÃZ���^�[,�k��B�s���q���,�t�P�u�P�O�ԂP��,802-0803,921-8881,1945/12/1,�Ɨ��s���@�l�����a�@�@�\,�R���@����,350,,50,,,1,0,0,0,0,1,1,0,0,1,1,0,0,0,0,0,1,0,1,1,1,1,0,0,1,1,0,0,0,1,1,1,0,0,1,0,0,0,1,1,1,0,0,0,1,0,0,1,0,0,1,0,0,
���b�]���a�@,�k��B�s���q���,���{���l���ڂQ�ԂP�X��,800-0208,471-2882,1980/7/1,��Ö@�l�@���b��,�s���@�׎q,55,,,,,1,0,0,0,0,0,0,0,0,1,1,0,0,0,0,0,0,0,0,0,0,0,0,0,0,0,0,0,1,1,0,0,0,0,0,0,0,1,0,1,0,0,0,0,1,0,0,0,0,1,0,0,0,�������O��
�Љ���@�l�ǘa��@��܂т��w��,�k��B�s���q���,�厚�؉��U�O�W�Ԓn,803-0184,451-6262,1977/6/17,�Љ���@�l�@�ǘa��,�O���@��O,100,,,,,1,0,0,0,0,1,0,0,0,0,0,0,0,0,0,0,0,0,0,0,0,0,0,0,0,0,0,0,0,0,0,0,0,0,0,0,0,0,0,0,0,0,0,0,0,0,0,0,0,0,0,0,0,
���a�a�@,�k��B�s���q���,��P�{���꒚�ڂR�ԂP��,802-0971,962-1008,1990/10/1,��Ö@�l�@�h�V��,�v��@����,94,105,,,,1,0,0,0,0,1,0,0,0,1,1,0,0,1,0,0,0,0,0,0,1,0,0,0,0,1,0,0,1,1,0,1,0,0,0,1,0,1,1,1,1,1,1,0,0,0,0,0,0,0,0,0,0,�]�_�o����
��˕a�@,�k��B�s�ᏼ��,���~�Ђт��̈꒚�ڂP�O�ԂP��,808-0139,742-2000,1966/7/18,��Ö@�l�@�O�F��,���c�@�����q,,,228,,,1,1,0,0,0,0,1,1,0,0,0,0,0,0,0,0,0,0,0,0,0,0,0,0,1,0,0,0,1,0,0,0,0,0,0,0,0,0,0,0,0,0,0,0,0,0,0,0,0,0,0,0,0,
��Ö@�l�@�Z�c�a�@,�k��B�s�ᏼ��,�厚剏Z�P�S�R�T�Ԓn,808-0122,741-1301,1991/9/1,��Ö@�l�@�Z�c�a�@,�Z�c�@����,,,209,,,1,0,0,0,0,0,1,1,0,0,0,0,0,0,0,0,0,0,0,0,0,0,0,0,0,0,0,0,1,0,0,0,0,0,0,0,0,0,0,0,0,0,0,0,0,0,0,0,0,0,0,0,0,
�͓��a�@,�k��B�s��������,�c�㒬�Q�O�ԂP��,805-0046,651-6737,1996/1/1,��Ö@�l�@���K��,�H��@��,,,200,,,1,0,0,0,0,0,1,1,0,0,0,0,0,0,0,0,0,0,0,0,0,0,0,0,0,0,0,0,0,0,0,0,0,0,0,0,0,0,0,0,0,0,0,0,0,0,0,0,0,0,0,0,0,
��Ö@�l�@�Ε���@�����呠�a�@,�k��B�s��������,�͓��񒚖ڂS�ԂP�P��,805-0045,651-2507,1987/10/1,��Ö@�l�@�Ε���,���R�@���v,,,180,,,1,0,0,0,0,0,1,0,1,0,0,0,0,0,0,0,0,0,0,0,0,0,0,0,0,0,0,0,0,0,0,0,0,0,0,0,0,0,0,0,0,0,0,0,0,0,0,0,0,0,0,0,0,
�Љ���@�l�������c�ϐ���x���������ϐ���������a�@,�k��B�s��������,�t�̒��ܒ��ڂX�ԂQ�V��,805-0050,662-5211,1927/4/29,�Љ���@�l�������c�ϐ���,�ÐX�@���_,399,,,,,1,0,0,0,0,1,0,0,1,1,1,0,0,1,1,0,0,0,0,0,1,1,0,0,1,1,0,0,1,1,1,1,0,0,1,0,0,1,1,1,1,1,0,0,1,0,0,1,0,0,1,0,1,�t���O�� ����ڐA�O�� ���ǊO�� �̑�����
����]���a�@,�k��B�s��������,����O���ڂP�X�ԂP��,807-0081,611-0456,1956/5/1,��Ö@�l�@�`�ĉ�,�]���@�`�T,,,207,,,1,0,0,0,0,0,1,0,0,0,0,0,0,0,0,0,0,0,0,0,0,0,0,0,0,0,0,0,0,0,0,0,0,0,0,0,0,0,0,0,0,0,0,0,0,0,0,0,0,0,0,0,0,
��Ö@�l�@�Вc����@���������a�@,�k��B�s��������,�����O���ڂP�Q�ԂP�Q��,807-0846,691-3344,1964/6/25,��Ö@�l�@�Вc����,�g�Z�@��,,,410,,,1,0,0,0,0,0,1,0,0,0,0,0,0,0,0,0,0,0,0,0,0,0,0,0,0,0,0,0,0,0,0,0,0,0,1,0,0,0,0,0,0,0,0,0,0,0,0,0,0,0,0,0,0,
��Ö@�l�@�O����@�ܔ��a�@,�k��B�s��������,�{��O���ڂQ�U�ԂP�W��,807-0801,691-4366,1988/4/1,��Ö@�l�@�O����,����@����,,,197,,,0,0,0,0,0,0,1,1,0,0,0,0,0,0,0,0,0,0,0,0,0,0,0,0,0,0,0,0,0,0,0,0,0,0,0,0,0,0,0,0,0,0,0,0,0,0,0,0,0,0,0,0,0,
�V����a�@,�k��B�s��������,����Ö��꒚�ڂT�ԂP��,807-0075,612-3100,1995/9/1,��Ö@�l�@�V����,�͊ہ@�L��,20,59,,,,1,0,0,0,0,0,0,0,0,1,1,0,0,0,0,0,0,0,0,0,0,1,0,0,1,0,0,0,1,0,0,1,0,1,0,1,1,0,0,1,1,0,0,0,0,0,0,0,0,0,0,0,0,�]�_�o����
��Ö@�l�@���щ�@���������a�@,�k��B�s��������,���������꒚�ڂP�S�ԂP�W��,807-1102,617-0173,1993/2/1,��Ö@�l�@���щ�,�ɍ��@�׎�,74,,,,,1,0,0,1,0,0,0,0,0,1,1,0,0,0,0,0,0,0,0,0,0,0,0,0,0,1,0,0,1,0,0,0,0,0,0,0,0,0,0,0,0,0,0,0,0,0,0,0,0,0,0,0,0,
���}�a�@,�k��B�s��������,���}�꒚�ڂV�ԂQ�O��,807-0856,603-0111,1993/12/1,�����Ö@�l�@���}��,����@�m�G,121,78,,,,1,0,0,0,0,0,0,0,0,0,0,0,0,0,0,0,0,0,0,0,0,0,0,0,0,0,0,0,1,0,0,0,0,0,0,0,0,1,1,1,1,0,1,0,0,0,0,0,0,0,0,0,0,���������� �]�_�o����
�Y�ƈ�ȑ�w�a�@,�k��B�s��������,�㐶���u�P�ԂP��,807-8556,603-1611,1979/6/15,�w�Z�@�l�@�Y�ƈ�ȑ�w,�c���@���[,638,,40,,,1,0,0,0,0,1,1,0,0,1,1,1,0,1,0,1,1,1,0,0,1,1,0,0,1,1,0,0,1,1,1,0,0,0,0,1,0,0,1,0,0,0,0,0,0,0,0,0,0,0,1,0,1,�]��
��Ö@�l�@�Вc���S��@���������a�@,�k��B�s��������,�����꒚�ڂP�O�ԂP��,806-0059,631-7511,1984/1/1,��Ö@�l�@�Вc���S��,�~��@����,120,,,,,1,0,0,0,0,0,0,0,0,0,0,0,0,0,0,0,0,0,0,0,0,0,0,0,0,0,0,0,1,0,0,0,0,0,0,0,0,1,1,1,1,0,0,0,0,0,0,0,0,0,0,0,0,�S������ �ݓ��������� �咰���������� ���A�a��ӓ��� ���ː��f�f��
�u�m�K�a�@,�k��B�s��������,�厚�����P�O�S�Ԓn�̂P,807-0831,602-6631,1995/5/1,�i��@�g��,�i��@�g��,,250,,,,1,1,1,0,1,0,0,0,1,0,0,0,0,0,0,0,0,0,0,0,0,0,0,0,0,0,0,0,1,0,0,0,0,0,0,0,0,0,0,0,0,0,0,0,0,0,0,0,0,0,0,0,0,
�������b�a�@,�k��B�s��������,�؉����꒚�ڂP�Q�ԂQ�R��,807-1261,618-2100,1991/6/1,��Ö@�l�@���b�r��,�R�c�@�p��,60,70,,,,1,1,0,1,1,0,0,0,0,0,0,0,0,0,0,0,0,0,0,0,0,0,0,0,0,0,0,0,1,1,0,0,0,0,0,0,0,0,0,0,0,0,0,0,0,0,0,0,0,0,0,0,0,
���S�L�O�����a�@,�k��B�s��������,�t�̒��꒚�ڂP�ԂP��,805-0050,672-3176,1997/6/1,�Љ��Ö@�l�@���S�L�O�����a�@,�É�@���V,453,,,,,1,0,0,0,0,1,0,0,0,1,1,1,0,1,1,0,0,1,0,0,1,1,0,0,1,1,0,0,1,1,1,1,0,0,0,0,0,1,1,1,1,1,1,0,1,0,0,1,0,0,1,0,0,�̑����� �ɘa�P�A���� �ɘa�P�A�O�� ���ǊO�� �]�� ��ᇓ���
��Ö@�l���傤���@���a�����a�@,�k��B�s��������,���}�O���ڂP�R�ԂP��,807-0856,602-1151,1997/5/1,��Ö@�l ���傤���,�Y��@�׉p,77,,,,,0,0,0,0,0,0,0,0,0,1,1,0,0,0,0,0,0,0,0,0,0,0,0,0,0,0,0,0,1,0,0,0,0,0,0,0,0,0,0,0,0,0,0,0,0,0,0,0,0,0,0,0,0,
�V�h��a�@,�k��B�s���q�k��,�ٓV���P�Q�ԂP�P��,803-0856,571-0086,1997/12/1,�Љ���@�l���q�V�h��,�i�c�@�뎡,,105,,,,1,0,0,0,0,0,0,0,0,0,1,0,0,0,0,0,0,0,0,0,0,0,0,0,1,0,0,0,1,1,0,0,0,0,0,0,0,0,0,0,1,1,0,0,0,0,0,0,0,0,0,0,0,
��Ö@�l�Вc�@���萮�`�O�ȕa�@,�k��B�s��������,���䒬�T�ԂQ�X��,806-0032,631-3565,1998/1/1,��Ö@�l�Вc�@���萮�`�O�ȕa�@,���΁@�_��,65,,,,,0,0,0,0,0,0,0,0,0,0,1,0,0,0,0,0,0,0,0,0,0,0,0,0,0,0,0,0,1,0,1,0,0,0,0,0,0,1,0,0,0,0,0,0,0,0,0,0,0,0,0,0,0,
�t��a�@,�k��B�s�ᏼ��,�t�䓌�꒚�ڂP�ԂP��,808-0141,742-1666,1998/7/1,��Ö@�l�@�i����,�i�c�@�M�v,48,,,,,1,0,0,0,0,0,0,0,0,0,0,0,0,0,0,0,0,0,0,0,0,0,0,0,0,0,0,0,1,1,0,0,0,0,0,0,0,0,1,1,1,0,0,0,0,0,0,0,0,0,0,0,0,
�������a�@,�k��B�s��������,�����꒚�ڂP�U�ԂQ�R��,807-0082,613-2121,1999/4/1,��C�@��,��C�@��,,201,,,,1,0,0,0,0,0,0,0,0,0,0,0,0,0,0,0,0,0,0,0,0,0,0,0,0,0,0,0,1,0,0,0,0,0,0,0,0,0,0,0,0,0,0,0,0,0,0,0,0,0,0,0,0,
�k��B�����R�����a�@,�k��B�s���q���,�厚����P�R�X�Ԓn�̂Q�P,800-0257,475-6262,2001/1/16,�Љ��Ö@�l�@�k��B�a�@,���c�@�p��,,160,,,,1,0,0,0,0,0,0,0,0,0,0,0,0,0,0,0,0,0,0,0,0,0,0,0,0,0,0,0,1,0,0,0,0,0,0,0,0,0,0,0,0,0,0,0,0,0,0,0,0,0,0,0,0,
��Ö@�l�ǘa��@������a�@,�k��B�s���q���,�厚�؉��T�T�T�Ԓn,803-0184,451-0303,2000/4/1,��Ö@�l�@�ǘa��,���X�@��,0,0,136,0,0,0,0,0,0,0,0,1,1,0,0,0,0,0,0,0,0,0,0,0,0,0,0,0,0,0,0,0,0,0,0,0,0,0,0,0,0,0,0,0,0,0,0,0,0,0,0,0,0,0,0,0,0,0,
�啽���f�B�J���P�A�a�@,�k��B�s��������,�啽�O���ڂP�S�ԂV��,807-0083,614-2101,2000/11/1,��Ö@�l�Вc�@������,�g�c�@�׌�,44,120,,,,1,1,1,0,1,0,0,0,0,1,1,0,0,1,0,0,0,0,0,0,0,0,0,0,1,1,0,1,1,0,0,0,0,0,0,0,0,0,0,0,0,0,0,0,0,0,0,0,0,0,0,0,0,
�k��B��ÌY������Õ��a�@,�k��B�s���q���,�t�R���꒚�ڂP�ԂP��,802-0837,962-5931,2000/6/9,�@����b,,,,83,3,,1,0,0,0,0,0,1,0,0,0,0,0,0,0,0,0,0,0,0,0,0,0,0,0,0,0,0,0,0,0,0,1,0,0,0,0,0,0,0,0,0,0,0,0,0,0,0,0,0,0,0,0,0,
���q���Õa�@,�k��B�s���q�k��,�����Ìܒ��ڂP�O�ԂR�P��,803-0846,571-0077,2001/6/1,��Ö@�l�Вc�@���M��,��@���v,53,47,,,,1,1,1,0,1,0,0,0,0,0,0,0,0,0,0,0,0,0,0,0,0,0,0,0,0,0,0,0,1,1,0,0,0,0,0,0,0,0,0,0,0,0,0,0,0,0,0,0,0,0,0,0,0,
��Ö@�l�@�l�c�a�@,�k��B�s��������,����O���ڂW�ԂV��,806-0021,621-0198,2001/12/1,��Ö@�l�@�l�c�a�@,�_�c�@��,24,60,,,,1,0,0,0,0,0,1,0,0,1,1,0,0,0,0,0,0,0,0,0,0,0,0,0,0,0,0,0,1,0,0,0,0,0,0,0,0,0,0,0,1,0,0,0,0,0,0,0,0,1,0,0,0,
��Ö@�l�@������@���X�ؕa�@,�k��B�s��������,�g�ˎ����X�ԂR�U��,807-1114,617-0770,2003/3/1,��Ö@�l�@������@���X�ؕa�@,���@�M��Y,40,34,,,,1,0,0,0,0,0,0,0,0,0,1,0,0,0,0,0,0,0,0,0,0,0,0,0,1,0,0,0,1,1,0,0,0,0,0,0,0,0,1,1,1,0,0,0,0,0,0,0,0,0,0,0,0,
��]���a�@,�k��B�s���q���,��]���ܒ��ڂP�R�ԂP��,800-0223,473-8575,2003/2/12,��Ö@�l�@�щ�,�p�J�@��o�m,,136,,,,1,0,0,0,0,0,0,0,1,1,1,0,0,1,0,0,0,0,0,0,0,0,0,0,0,0,0,0,1,0,0,0,0,0,0,0,0,0,0,0,0,0,0,0,0,0,0,0,0,0,0,0,0,
�k��B�����a�@,�k��B�s���q�k��,���t���꒚�ڂP�R�ԂP��,802-0084,931-1085,2002/10/15,�Љ��Ö@�l�@�k��B�a�@,���O�@�P�Y,60,240,,,,1,0,0,0,0,0,0,0,0,0,0,0,0,0,0,0,0,0,0,0,0,0,0,0,0,0,0,0,1,0,0,0,0,0,0,0,0,0,0,1,1,0,0,0,0,0,0,0,0,0,0,0,0,
��Ö@�l�@�Вc��?��@�G���[���a�@,�k��B�s��������,�F�c�꒚�ڂP�P�ԂP��,807-0828,601-3511,2002/11/1,��Ö@�l�Вc��?��,�g���@�鏃,35,,,,,0,0,0,0,0,0,0,0,0,0,0,0,0,0,0,0,0,0,1,1,0,0,0,0,0,0,0,0,0,0,0,0,0,0,0,0,0,0,0,0,0,0,0,0,0,0,0,0,0,0,0,0,0,
�Љ��Ö@�l������@�˔����n�r���e�[�V�����a�@,�k��B�s�˔���,���œ񒚖ڂS�ԂR�P��,804-0092,861-1500,2003/2/11,�Љ��Ö@�l�@������,�����@�M�F,99,74,,,,1,0,0,0,0,0,0,0,0,0,0,0,0,0,0,0,0,0,0,0,0,0,0,0,0,0,0,0,1,0,0,0,0,0,0,0,0,0,0,0,0,0,0,0,0,0,0,0,0,0,0,0,0,�y�C���N���j�b�N����
��Ö@�l�@�����Џ��{�a�@,�k��B�s���q���,�Óc�ܒ��ڂP�ԂT��,800-0242,474-3358,2003/4/1,��Ö@�l�@�����Џ��{�a�@,���{�@�M�i,70,30,,,,1,0,0,0,0,0,0,0,1,0,0,0,0,0,0,0,0,0,0,0,0,0,0,0,0,0,0,0,1,0,0,0,0,0,0,0,0,1,0,1,1,0,0,0,0,0,0,0,0,0,0,0,0,
�˔������a�@,�k��B�s�˔���,�V�r�꒚�ڂT�ԂT��,804-0082,881-8181,2003/9/1,���v���c�@�l�@���a��,�񌩁@�N�v,102,201,,,,1,0,0,0,0,0,0,0,1,1,1,1,0,0,0,0,0,0,0,0,0,0,0,0,1,1,0,0,1,1,0,0,0,0,0,0,0,0,1,1,1,0,0,0,0,0,0,0,0,1,0,0,0,
�k��B���q�a�@,�k��B�s���q�k��,��x��O���ڂP�X�ԂP��,802-0022,511-7381,2003/4/7,�Љ��Ö@�l�@�k��B�a�@,??�c�@�q��,77,120,,,,1,0,0,0,0,0,0,0,0,0,0,0,0,0,0,0,0,0,0,0,0,0,0,0,0,0,0,0,1,0,0,0,0,0,0,0,0,0,0,1,1,0,0,0,0,0,0,0,0,0,0,0,0,
�F��a�@,�k��B�s�ᏼ��,�{���񒚖ڂP�T�ԂU��,808-0034,751-2606,2003/8/1,��Ö@�l�@���F��,�F��@��,106,37,,,,1,0,1,0,1,0,0,0,0,1,1,0,0,1,0,0,0,0,0,0,0,0,0,0,0,0,0,0,1,0,0,0,0,0,0,0,0,0,0,0,0,0,0,0,0,0,0,0,0,0,0,0,0,���͓���
��Ö@�l�ӂ�ĉ�@����a�@,�k��B�s��������,�R�H�������P�R�ԂQ�V��,805-0033,653-2122,2003/12/15,��Ö@�l�ӂ�ĉ�,����@���j,20,100,,,,1,1,1,0,1,1,0,0,1,0,1,0,0,0,0,0,0,0,0,0,0,0,0,0,0,0,0,0,1,1,0,0,0,0,0,0,0,0,0,0,0,0,0,0,0,0,0,0,0,0,0,0,0,
�Ɨ��s���@�l�n���Ë@�\���i�@�\�@��B�a�@,�k��B�s��������,�݂̉Y�꒚�ڂW�ԂP��,806-8501,641-5111,2004/5/1,�Ɨ��s���@�l�n���Ë@�\���i�@�\,���R�@���F,575,,,,,1,0,0,0,0,1,1,0,0,1,1,1,0,1,1,1,1,1,0,0,1,1,0,0,1,1,0,0,1,0,1,0,0,0,0,0,0,0,1,1,1,1,1,1,1,0,0,1,0,0,1,1,1,�ݒ��E�̑��E�_�̂��E�X���E���򕔊O�� �ݒ��E�̑��E�_�̂��E�X������ ��ᇁE��������� �V�� �z�포���� �V���������� ���f ���� �ߊO �S�� �]�� �ɘa�P�A����
�����u�@���a�@,�k��B�s���q�k��,�����u�O���ڂX�ԂQ�O��,802-0052,921-0438,2005/10/11,��Ö@�l�Вc�@�b�F��,�Óc�@�O,69,,,,,1,0,0,0,0,0,0,0,0,0,0,0,0,0,0,0,0,0,0,0,0,0,0,0,0,0,0,0,1,0,0,1,0,0,0,0,0,1,1,1,1,0,0,0,0,0,0,0,0,0,0,0,0,
���{���a�@,�k��B�s���q���,���{���꒚�ڂX�ԂR�X��,800-0208,475-5001,2004/11/1,��Ö@�l�@���b��,�����@�~,,95,,,,1,0,0,0,0,0,0,0,0,0,0,0,0,0,0,0,0,0,0,0,0,0,0,0,0,0,0,0,1,0,0,0,0,0,0,0,0,0,0,0,0,0,0,0,0,0,0,0,0,0,0,0,0,
�ѓc�a�@,�k��B�s���q�k��,�_�K���Q�ԂR�R��,802-0038,551-2481,2006/5/1,�ѓc�@�M�F,�ѓc�@�M�F,,37,,,,0,0,0,1,1,0,0,0,0,1,1,0,0,0,0,0,0,0,0,0,0,0,0,0,1,0,0,0,0,0,0,0,0,0,0,0,0,0,0,0,0,0,0,0,0,0,0,0,0,0,0,0,0,
������w�@�l�@��B���ȑ�w�����a�@,�k��B�s���q�k��,�^�ߓ񒚖ڂU�ԂP��,803-8580,582-1131,2006/4/1,������w�@�l�@��B���ȑ�w,�쌳�@���v,60,,,,,1,0,0,0,0,0,0,0,0,1,0,0,0,0,0,0,0,0,0,0,0,0,0,0,0,0,0,0,0,0,1,1,1,1,0,1,0,0,0,0,0,0,0,0,0,0,0,0,0,0,0,0,0,
�V�������a�@,�k��B�s��i��,�嗢�V���Q�ԂT��,800-0057,391-1001,2008/1/1,�Љ��Ö@�l���c�@�r�F��,�b��@�G�M,214,,,,,1,0,0,0,0,0,0,0,0,1,1,1,0,1,1,0,0,0,0,0,0,0,0,0,1,1,0,0,1,1,1,0,0,0,0,0,0,1,1,1,1,0,0,0,1,0,0,0,0,0,1,0,1,�����哜�A�a���ȁ@���ǊO��
�Љ��Ö@�l������@�˔������a�@,�k��B�s�˔���,�򌩓񒚖ڂT�ԂP��,804-0093,871-5421,2008/5/4,�Љ��Ö@�l�@������,�����@�S�j,218,,,,,1,0,0,0,0,1,1,0,0,1,1,1,0,1,1,0,1,1,0,0,1,0,0,0,1,1,0,0,1,0,1,1,0,0,0,1,0,0,1,1,1,1,0,1,1,0,0,1,0,0,1,1,1,������E��ӓ��� �̑��E�_�̂��E�X���O�� ���ǊO�� ���ː��f�f�� ���ː����É�
���q�L�O�a�@,�k��B�s���q�k��,���O���ڂQ�ԂP��,802-0001,511-2000,2010/12/25,��ʍ��c�@�l�@���������,���n�@�F��,656,,,,,1,0,0,0,0,0,0,0,0,1,1,1,0,1,1,1,0,0,0,1,1,1,0,0,1,1,0,0,0,1,1,0,0,0,0,0,0,0,1,1,1,1,0,1,1,0,0,1,0,0,1,0,0,���ǊO�� ���򕔊O�� ���A�a�E��������� ���A�a�E��ӓ��� �ɘa�P�A�E���_�� �]�_�o����
��Ö@�l���傤���@���a�Ȃ݂��a�@,�k��B�s��������,�����q���P�R�ԂP��,806-0037,644-0756,2010/3/19,��Ö@�l���傤���,�Y��@�א�,106,,,,,0,0,0,0,0,0,0,0,1,1,1,0,0,0,0,0,0,0,0,0,0,0,0,0,0,0,0,0,1,0,1,0,0,0,0,0,0,0,0,1,1,0,0,0,1,0,0,0,0,0,0,0,0,����������
��蒬���n�r���e�[�V�����a�@,�k��B�s���q�k��,��蒬�P�S�ԂP�W��,803-0814,592-1166,2012/11/1,���v���c�@�l�@���a��,�ēc�@�_,55,275,,,,1,0,0,0,0,0,0,0,0,0,1,0,0,1,0,0,0,0,0,0,0,0,0,0,1,0,0,0,1,1,0,0,0,0,0,0,0,0,0,0,0,0,0,0,0,0,0,0,0,0,0,0,0,
�Y�ƈ�ȑ�w�ᏼ�a�@,�k��B�s�ᏼ��,�l���꒚�ڂP�V�ԂP��,808-0024,761-0090,2011/4/1,�w�Z�@�l�@�Y�ƈ�ȑ�w,���{�@���_,150,,,,,1,0,0,0,0,1,0,0,0,1,1,0,0,1,0,0,0,1,0,0,1,1,0,0,1,1,0,0,1,1,1,0,0,0,0,0,0,0,0,1,1,0,0,0,0,0,0,0,0,0,0,0,0,�ɘa�P�A�E��ᇐ��_��
���q�상�f�B�J���P�A�a�@,�k��B�s���q���,�������񒚖ڂP�S�ԂQ��,800-0206,473-1010,2013/3/1,��Ö@�l�Вc�@������,�E�c�@���K,,90,,,,1,0,0,0,0,1,0,0,0,0,0,0,0,0,0,0,0,0,0,0,0,0,0,0,0,0,0,0,1,0,0,0,0,0,0,0,0,0,0,0,0,0,0,0,0,0,0,0,0,0,0,0,0,��������
�×{��쎖�Ə��@�ЂȂ���,�k��B�s��������,�^���q�񒚖ڂQ�ԂP�Q��,807-1144,618-7566,2013/4/16,�Љ���@�l�@�J�̉�,�͖�@�m��,46,,,,,1,0,0,0,0,1,0,0,0,0,0,0,0,0,0,0,0,0,0,0,0,0,0,0,0,0,0,0,0,0,0,0,0,0,0,0,0,0,0,0,0,0,0,0,0,0,0,0,0,0,0,0,0,
��Ö@�l���c�͂܂䂤��@�V���q�a�@,�k��B�s��������,�S���񒚖ڂQ�O�ԂP��,806-0057,641-1239,2014/5/1,��Ö@�l���c�͂܂䂤��@,⫓��@���F,41,,,,,1,0,0,0,0,0,0,0,0,0,0,0,0,0,0,0,0,0,0,0,0,0,0,0,0,0,0,0,1,0,0,0,0,0,0,0,0,0,0,1,0,1,0,0,0,0,0,0,0,0,0,0,0,
�k��B�����a�@,�k��B�s���q�k��,����쒬�P�ԂP��,802-0054,921-0560,2016/5/1,�Љ��Ö@�l�@�k��B�a�@,�i�c�@����,360,,,,,1,0,0,0,0,1,0,0,0,1,1,1,0,1,1,0,0,0,1,1,1,1,0,0,1,1,0,0,1,0,1,0,0,0,1,0,0,1,1,1,1,0,1,1,1,0,0,1,0,0,1,1,1,�l�H���͓��� ���ː����É� ���ː��f�f�� �����O�� ���򕔊O��
�˔������a�@,�k��B�s�˔���,�����؈꒚�ڂR�ԂR�R��,804-0025,871-2760,2016/7/17,��Ö@�l�@��a���,�V���@�a�`,193,,,,,1,0,0,0,0,1,0,0,1,1,1,1,0,1,1,1,0,1,0,0,1,1,0,0,1,1,0,0,1,1,1,1,0,0,0,1,0,1,1,1,1,0,1,0,1,0,0,1,0,0,0,0,0,
���q�Z���g�����a�@,�k��B�s���q���,����{���l���ڂU�ԂP��,800-0241,473-0246,2016/4/1,��Ö@�l�@���b��,�ѓc�@����,,108,,,,1,0,0,0,0,0,0,0,0,1,0,0,0,0,0,0,0,0,0,0,0,0,0,0,0,0,0,0,0,0,1,0,0,0,0,0,0,0,0,0,0,0,0,0,1,0,0,0,0,1,0,0,0,
�×{��쎖�Ə��@�q�R�×{�@,�k��B�s�˔���,�������P�R�ԂP�R��,804-0066,588-1040,2017/5/18,��Ö@�l�@��a���,�{���@�ǎ�,27,,,,,1,0,0,0,0,1,0,0,0,0,0,0,0,0,0,0,0,0,0,0,0,0,0,0,0,0,0,0,0,0,0,1,0,0,0,1,0,0,0,0,0,0,0,0,0,0,0,0,0,0,0,0,0,
���q���ӂ˕a�@,�k��B�s���q�k��,�M�D���R�ԂR��,802-0073,941-4550,2018/12/1,��Ö@�l�Вc�@�V����,����@�L,76,23,,,,1,0,0,0,0,1,0,0,0,0,1,0,0,0,0,0,0,0,0,0,0,1,0,0,0,0,0,0,1,0,0,0,0,0,0,0,1,0,1,0,1,0,0,0,0,0,0,0,0,0,0,0,0,
�k��B�s�������È�Z���^�[,�k��B�s���q���,�t�P�u�P�O�ԂS��,802-0803,922-5596,2018/11/1,�k��B�s,���z�@���V,165,,,,,1,0,0,0,0,1,1,0,0,0,1,0,0,0,0,0,0,0,0,1,1,1,0,0,0,1,0,0,1,0,0,1,1,1,0,0,0,0,0,0,0,0,0,0,0,0,0,0,0,0,0,0,0,�������_��
��Ö@�l�Вc����@�O�c�a�@,�k��B�s���q�k��,�Ж�V���꒚�ڂP�P�ԂV��,802-0062,921-3968,2019/5/1,��Ö@�l�Вc����,�O�c�@��,55,43,,,,1,0,0,0,0,0,0,0,0,0,0,0,0,0,0,0,0,0,0,0,0,0,0,0,0,0,0,0,1,0,0,0,0,0,0,0,0,1,1,0,1,1,1,1,0,1,0,0,0,0,0,0,0,
�k��B�s����ÃZ���^�[,�k��B�s���q�k��,�n�ؓ񒚖ڂP�ԂP��,802-0077,541-1831,2019/4/1,�n���Ɨ��s���@�l�k��B�s���a�@�@�\,����@�O,620,,,,16,1,0,0,0,0,1,1,0,0,1,1,0,0,1,1,1,1,1,0,0,1,1,0,0,1,1,0,0,1,1,1,1,0,0,1,0,0,0,1,1,1,0,0,1,1,1,0,1,0,1,1,0,1,�ɘa�P�A���� ��ᇓ��� ������E���A�a���� �̑����� ������O�� �咰�O�� �̑��O�� �_�̂��O�� �X���O�� �H���O�� �ݒ��O��
�k��B�s�������a�@,�k��B�s��������,���q�񒚖ڂU�ԂQ��,805-0059,662-6565,2019/4/1,�n���Ɨ��s���@�l�k��B�s���a�@�@�\,���{�@�D�i,350,,,,,1,0,0,0,0,1,1,0,0,1,1,1,0,1,1,0,1,0,0,1,1,1,0,0,1,1,0,0,1,1,1,1,0,0,0,0,0,0,0,1,0,0,0,0,1,0,0,0,0,0,0,1,1,�̑��O�� �_�̂��O�� �X���O�� �������O�� �������t�E��ᇓ��� �����_�o����
�����n�l�a�@,�k��B�s��������,�w�R�꒚�ڂS�ԂQ�W��,806-0012,663-5100,2020/2/1,��Ö@�l�͂邩,�{���@�R�V,39,0,0,0,0,1,0,0,0,0,0,0,0,0,1,0,0,0,0,0,0,0,0,0,0,0,0,0,0,0,0,0,0,1,0,0,0,0,0,0,0,0,0,0,0,0,0,0,0,0,0,0,0,0,0,0,0,1,�ɘa�P�A���� �]��
���a���蒬�a�@,�k��B�s���q�k��,��蒬�P�R�ԂP��,803-0814,592-5511,2022/3/1,���v���c�@�l���a��,�g��@����Y,449,,,,,1,0,0,0,0,1,1,0,1,1,1,1,0,1,0,1,0,1,0,0,1,1,0,0,1,1,0,0,1,1,1,0,0,0,0,0,0,1,1,1,1,1,1,0,1,1,0,0,0,0,1,0,1,�l�H���͓��� ��ӓ���
�k��B����a�@,�k��B�s���q���,����ܒ��ڂP�O�ԂP�O��,800-0257,923-8833,2021/3/7,�Љ��Ö@�l�@�k��B�a�@,�i���@��,102,120,,,,1,0,0,0,0,0,0,0,0,0,0,0,0,0,0,0,0,0,0,0,0,0,0,0,0,0,0,0,1,0,0,0,0,0,0,0,0,0,0,0,0,0,0,0,0,0,0,0,0,0,0,0,0,
��B�S���L�O�a�@,�k��B�s��i��,���c�񒚖ڂP�ԂP��,800-0031,381-5661,2020/4/1,��Ö@�l��t��,�Ë��@��,158,78,,,,1,0,0,0,0,0,0,0,1,1,1,0,0,0,0,0,0,0,0,1,1,1,0,0,0,1,0,0,1,1,0,0,0,0,0,0,0,1,1,1,1,0,1,1,0,0,0,1,0,1,1,1,0,�̑�����
���q���a�@,�k��B�s���q�k��,�����È꒚�ڂP�Q�ԂP�S��,803-0846,582-7730,2021/11/15,��Ö@�l�@�^�߉�,�����@�G�q,32,48,,,,0,0,0,0,0,0,0,0,0,0,0,1,0,0,0,0,0,0,0,0,0,0,0,0,1,0,0,0,0,0,0,0,0,0,0,0,0,1,0,0,0,1,1,0,0,0,0,0,0,0,0,0,0,�l�H���͓��� ���������
�k��B�������a�@,�k��B�s��������,���c�꒚�ڂS�ԂR��,805-0071,661-5915,2022/10/1,�Љ��Ö@�l�@�k��B�a�@,��c�@�v�M,200,220,,,,1,0,0,0,0,0,0,0,1,0,0,0,0,0,0,0,0,0,0,0,0,0,0,0,0,0,0,0,1,0,0,0,0,0,0,0,0,0,0,0,0,0,0,0,0,0,0,0,0,0,0,0,0,
�R���n�r���e�[�V�����a�@,�k��B�s��������,�R�꒚�ڂV�ԂQ��,806-0043,642-0070,2023/4/1,�Љ��Ö@�l���c�@�r�F��,���@����,50,,,,,0,0,0,0,0,0,0,0,0,1,1,0,0,0,0,0,0,0,0,0,0,0,0,0,0,0,0,0,1,0,0,0,0,0,0,0,0,0,1,0,1,0,0,0,1,0,0,0,0,1,0,0,0,
�Ɨ��s���@�l�J���Ҍ��N���S�@�\��B�J�Еa�@,�k��B�s���q���,�]���k���P�ԂP��,800-0296,471-1121,2011/5/1,�Ɨ��s���@�l�J���Ҍ��N���S�@�\,�O�Y�@�T��,450,,,,,1,0,0,0,0,1,1,0,0,1,1,0,0,1,0,0,0,1,0,0,1,1,0,0,1,1,0,0,1,0,1,0,0,0,0,1,0,0,1,1,1,0,0,0,1,0,0,0,0,0,1,0,1,���ː��f�f�� ���ː����É� �]�_�o����
