�s���{���R�[�h���͎s�撬���R�[�h,NO,�s���{����,�s�撬����,����,����_�J�i,����_�p��,POI�R�[�h,�Z��,����,�ܓx,�o�x,���p�\�j��,�J�n����,�I������,���p�\�������L����,�����i��{�j,�����i�ڍׁj,����,����_�p��,�A�N�Z�X���@,���ԏ���,�o���A�t���[���,�A���於��,�A����d�b�ԍ�,�A��������ԍ�,�摜,�摜_���C�Z���X,URL,���l
401005,0000000001,������,�k��B�s,JR��i�`�w,�W�F�C�A�[�����W�R�E�G�L,,,�������k��B�s��i�搼�C�݈꒚��5-31,,,,���ΐ��؋��y��,,,,,,1914�N�i�吳�R�N�j�Ɍ��z���ꂽ�l�I�E���l�b�T���X�l���̉w�ɂ́A�S���w�ɂƂ��ď��߂č��̏d�v�������Ɏw�肳��܂����B���݂͕ۑ��C���H�����̂��߁A�w�ɂ����邱�Ƃ͏o���܂���B�i����31�N�t�����p�J�n�\��j,,,,,B&A��i�`,093-321-4151,,,,,
401005,0000000002,������,�k��B�s,����i�O���y��,�L���E���W�~�c�C�N���u,,,�������k��B�s��i��`��7-1,,,,���ΐ��؋��y��,09:00,17:00,�N�����x���ق�16�F30�܂�,����,��l100�~�A���E���w��50�~�i2�K�̂ݗL���j,1921�N�i�吳10�j�ɎO�䕨�Y�̎Ќ���y���Ƃ��Č��z���ꂽ���̏d�v�������ł��B2�K�̓A�C���V���^�C���v�Ȃ������̍ۂɏh�����������ƁA�u�ѕ����q�L�O���v������܂��B,,JR��i�`�w���k��2��,,,B��A��i�`,093-321-4151,,,,,
401005,0000000003,������,�k��B�s,����㏤�D,�L���E�I�I�T�J�V���E�Z��,,,�������k��B�s��i��`��7-18,,,,���ΐ��؋��y��,09:00,17:00,�N�����x�킽�����������M�������[�̂ݔN2��s��x,����,�킽�����������M�������[�̂ݗL����l100�~�A���E���w��50�~,1917�N�i�吳6�j�ɁA��㏤�D��i�x�X�Ƃ��Č��z�B�ٓ��ɂ́A�C���X�g���[�^�[�킽�������������̃M�������[��C�����}���z�[��������܂��B,,JR��i�`�w���k��2��,,,B��A��i�`,093-321-4151,,,,,
401005,0000000004,������,�k��B�s,����i�Ŋ�,�L���E���W�[�C�J��,,,�������k��B�s��i�擌�`��1-24,,,,���ΐ��؋��y��,09:00,17:00,�N�����x,����,,1912�N�i����45�j�Ɍ��z���ꂽ���������������̌����ŁA���a�����܂ŐŊ֒��ɂƂ��Ďg�p���Ă��܂����B�x�e����J�t�F�A�Ŋ�PR�R�[�i�[������܂��B,,JR��i�`�w���k��6��,,,B��A��i�`,093-321-4151,,,,,
401005,0000000005,������,�k��B�s,�u���[�E�B���O����,�u���[�E�B���O���W,,,�������k��B�s��i��`��4-1,,,,���ΐ��؋��y��,,,�J�����ԁF10�F00�A11�F00�A13�F00�A14�F00�A15�F00�A16�F00,,,1��6��A�������y�ɂ��킹�Ē��ˏオ��A���{�ōő勉�̕��s�Ґ�p�̒��ˋ��B�u���l�̐��n�v�ɑI�肳��Ă���A���ˋ������čŏ��Ɏ���Ȃ��œn�����J�b�v���͈ꐶ���΂��Ƃ����Ă��܂��B,,JR��i�`�w���k��3��,,,,,,,,,
401005,0000000006,������,�k��B�s,�O�X�O,�T���L���E,,,�������k��B�s��i�搴��O����6-8,,,,�ΐ��؋��y��,10:00,17:00,�k�x�l���j���i�j�Փ��̏ꍇ�͗����j,����,,���a6�N�Ɍ��Ă�ꂽ�ؑ�3�K���Ă̋������B�������闿���̌����Ƃ��Ă͋�B�ő勉�œ����͐������B�o��̊ԁA��L�ԁA�W�����Ȃǌ��w���ł��܂��B����s�������ӏ��̐��X�������������B,,JR��i�`�w���k��8��,,,�O�X�O,093-321-2651,,,,,
401005,0000000007,������,�k��B�s,���ۗF�D�L�O�}����,�R�N�T�C���E�R�E�L�l���g�V���J��,,,�������k��B�s��i�擌�`��1-12,,,,2�E3�K�͕���30�N3�����ŕ�,,,����30�N10���Ɋό��{�݂Ƃ��ă��j���[�A���I�[�v���\��,����,,�k��B�s�ƒ����E��A�s�Ƃ̗F�D�s�s����15���N���L�O���āA�鐭���V�A����ɑ�A�Ɍ��Ă�ꂽ�����𕡐��������́B�h�C�c�n�n�[�t�e�B���o�[�l������ۓI�ł��B,,JR��i�`�w���k��5��,,,���ۗF�D�L�O�}����,093-331-5446,,,,,
401005,0000000008,������,�k��B�s,��i�`���g���W�]��,���W�R�E���g���e���{�E�V�c,,,�������k��B�s��i�擌�`��1-32,,,,���ΐ��؋��y��,10:00,22:00,�s��x�i�N4����x�j���ق�21�F30�܂�,300�~,��l300�~�A���E���w��150�~,���E�I�Ɋ��􂵂�����I�͎��̐݌v�B���w�}���V������31�K�����ɂ���W�]�������i�`���g�����ቺ�Ɍ����낷���Ƃ��ł��A�܂��A�֖�C������]�ł��܂��B��i�̖����Ƃ��Ă��l�C�ł��B,,JR��i�`�w���k��8��,,,B��A��i�`,093-321-4151,,,,,
401005,0000000009,������,�k��B�s,�o�����p�فi��i�j,�C�f�~�c�r�W���c�J���i���W�j,,,�������k��B�s��i�擌�`��2-3,,,,�ΐ��؋��y��,10:00,17:00,���j�����j�Փ��̏ꍇ�͊J�ٔN���N�n�A�W���֊��Ԃ͋x��,700�~,��l700�~�A���E��w��500�~�A���E���w�������i�v�ی�ғ����j,�o�����Y�n�Ǝҏo�����O�̃R���N�V�����𒆐S�ɓW��������p�قł��B,,JR��i�`�w���k��8��,,,�o�����p�فi��i�j,093-332-0251,,,,,
401005,0000000010,������,�k��B�s,�C���v���U,�J�C�L���E�v���U,,,�������k��B�s��i��`��5-1,,,,���ΐ��؋��y��,10:00,22:00,�y���́z10�F00�`20�F00�y���H�z11�F00�`22�F00,,,��i�`���g���n��̑��D���܂�ɖʂ����������Ǝ{�݂ŁA���X�g�����̂ق��A�C�Y���A�G�݁A�َq�Ȃǖ�i�`�Ȃ�ł͂̓y�Y���[���B�g���b�N3D�A�[�g�~���[�W�A��������܂��B,,JR��i�`�w���k��2��,,,�C���v���U,093-332-3121,,,,,
401005,0000000011,������,�k��B�s,��B�S���L�O��,�L���E�V���E�e�c�h�E�L�l���J��,,,�������k��B�s��i�搴��񒚖�3-29,,,,���ΐ��؋��y��,09:00,17:00,�k�x�l��2���j��7���͑�2���E�؁A8���͖��x���ق�16�F30�܂�,300�~,��l�E���Z��300�~�A���w���ȉ�150�~�A4�Ζ�������,��B�S���̔��˂̒n�E��i�`���g���Ɍ��S���̋L�O�قł��B���N�̎����ԗ���S��������Y�̓W���̂ق��A�~�j�S����^�]�V�~�����[�^�[�Ȃǂ����đ̌����Ċy�������I,,JR��i�`�w���k��3��,,,��B�S���L�O��,093-322-1006,,,,,
401005,0000000012,������,�k��B�s,����A�q�H�㉮,�L���E�_�C�����R�E���E����,,,�������k��B�s��i�搼�C�݈꒚��3-5,,,,���ΐ��؋��y��,09:00,17:00,�N4��x��,����,,���a4�N�ɖ�i�Ŋ�1���㉮�Ƃ��Č��Ă���i�`�̍��ۃ^�[�~�i���Ƃ��Ďg���܂����B���݂̓C�x���g�╶���E�|�p�̔��\�̏�ƂȂ��Ă��܂��B,,JR��i�`�w���k��5��,,,����A�q�H�㉮,093-322-5020,,,,,
401005,0000000013,������,�k��B�s,�֖�C���~���[�W�A��,�J�������J�C�L���E�~���[�W�A��,,,�������k��B�s��i�搼�C�݈꒚��3-3,,,,����30�N�S�����A���j���[�A���H���̂��ߋx��,,,,,,����31�N�H���A���j���[�A���I�[�v���\��B,,JR��i�`�w���k��8��,,,�֖�C���~���[�W�A��,093-331-6700,,,,,
401005,0000000014,������,�k��B�s,�����^�T�C�N���E�����^�J�[,�����^�T�C�N���E�����^�J�[,,,�������k��B�s��i�擌�`��6-66,,,,���ΐ��؋��y��,10:00,18:00,�k�x�l1/1�A1/211�`3���܂ł�17�F00�܂�,"�����^�J�[1,000�~/30�����]��500�~/��",,2�l���d�C�����Ԃ��i�`���g���n��Ŏ؂�邱�Ƃ��o���܂��B����Řa�z���W�]��ւ��y�X�ł��I�d�����]�Ԃ́A���ւ܂ł̃T�C�N�����O�U��ɂ������߂ł��B,,JR��i�`�w���k��6��,,,JOYiNT��i�`,093-321-2272,,,,,
401005,0000000015,������,�k��B�s,��JR��B�{�Ѓr��,�L���E�W�F�C�A�[���L���E�V���E�z���V���r��,,,�������k��B�s��i�搼�C��1-6-2,,,,,09:00,18:00,�{�݂ɂ��قȂ�,,,1937�N�i���a12�j�A�O�䕨�Y�̖�i�x�X�Ƃ��Č��݂���A���͍��S��B���ǖ�i�S���Ǘ��ǂƂ��Ďg�p���ꂽ�����ł��B�PF�͖�i��̗��j��֖�C���̏�񔭐M�AF�͍��c�����Y���𒆐S�Ƃ����A�[�g�̑n�����M���_�B,,,,,,,,,,,
401005,0000000016,������,�k��B�s,��i�`���g���ό����Y��,���W�R�E���g���J���R�E�u�b�T���J��,,,�������k��B�s��i�擌�`��6-72,,,,���ΐ��؋��y��,,,�y��������s��z9�F30�`18�F00�y�k��B���݂₰�فz10�F00�`18�F00�k�x�l�s��,,,�k��B�̓��Y�i�E�C�Y���E���ٓ��A�L�x�Ɏ�葵�������X������܂��B��i�`�̃e�C�N�A�E�g�O�������l�C�ł��B,,JR��i�`�w���k���V��,,,B��A��i�`,093-321-4151,,,,,
401005,0000000017,������,�k��B�s,��i�d�C�ʐM���g����,���W�f���L�c�E�V�����g���J��,,,�������k��B�s��i��l��4-1,,,,�ΐ��؋��y��,09:00,17:00,�ŏI���ق�16�F30�k�x�l���j���i���j�����j���̏ꍇ�͗����j�N���N�n�i12/29�`1/3�j,,,1924�N�i�吳13�j�Ɍ��z���ꂽ��i�ōŏ��̓S�؃R���N���[�g�̌����ŁA�������珺�a�ɂ����ẮA���������ʐM�E�d�b�@��Ȃǂ�W�����Ă��܂��B,,JR��i�`�w���ԁA�k���Ŗ�10��,,,��i�d�C�ʐM���g����,093-321-1199,,,,,
401005,0000000018,������,�k��B�s,���i����,�}�c�i�K�u���R,,,�������k��B�s��i�搼�C��1-3-5�i����A�q�H�㉮�P�K�j,,,,�ΐ��؋��y��,09:00,17:00,�k�x�l���j���i���j�����x���̏ꍇ�͂��̗����j�A�ٓ�������,����,,"���i�������W�߂��f��|�X�^�[��p���t���b�g�Ȃǖ�40,000�_�������E�W���B����28�N5���ɓ��{�f���]�Ƒ�ܓ��ʏ܂���܂��A�S�����璍�ڂ��W�߂Ă��܂��B",,JR��i�`�w���k��5������A�q�H�㉮��,,,���i����,093-331-8013,,,,,
401005,0000000019,������,�k��B�s,�֖�A���D,�J�������������N�Z��,,,�������k��B�s��i�搼�C�݈꒚��-4-1,,,,���ΐ��؋��y��,06:15,21:50,�y���E�j�z7�F10�`,,�i�Г��j��l400�~�A���l200�~�A���]��1��250�~,��i�`�`���֊Ԃ��킸��5���Ō��т܂��B�֖�C�����f�̑D���͗����猩���Ȃ��i�F�𖞋i�ł��܂��B,,JR��i�`�w���k��1��,,,�֖�D�D(��)��i�c�Ə�,093-331-0222,,,,,
401005,0000000020,������,�k��B�s,��i�`���p�H�|������,���W�R�E�r�W���c�R�E�Q�C�P���L���E�V��,,,�������k��B�s��i�擌�`��6-722�K,,,,�ΐ��؋��y��,10:00,17:00,�k�x�l���j���i�j���̏ꍇ�͊J�فj�E�N���N�n,����,,��i�`�ŃA�[�e�B�X�g�̈琬���s���Ă��錤�����ł��B�A�[�e�B�X�g�̍H�[���i�����w���邱�Ƃ��ł��܂��B,,JR��i�`�w���k���V��,,,��i�`���p�H�|������,093-322-1235,,,,,
401005,0000000021,������,�k��B�s,��i�ԗ����v���C�X,���W�A�J�����K�v���C�X,,,�������k��B�s��i��嗢�{��3-11-1,,,,�{�݂ɂ��قȂ�,,,,,,1913�i�吳2�j�z�̃T�b�|���r�[���H��̗��������Q�𗘗p���������{�݂ł��B�r�[�������ق�r���b�t�F���X�g�����A�C�x���g�z�[���A�ʐ^�قȂǂ�����A���݁A���̗L�`�������ɓo�^����Ă��܂��B,,JR��i�w���k��3��,,,��i�ԗ�����y��,093-372-0962,,,,,
401005,0000000022,������,�k��B�s,�֖�C���炢�Ԋ�,�J�������J�C�L���E���C�u�J��,,,�������k��B�s��i�搼�C��1-6-21�K,,,,���ΐ��؋��y��,09:00,18:00,�k�x�l��2�E4�ؗj,����,,�֖�C���ɐݒu���ꂽ���C�u�J�����̉f����������A�P���p�̃V�~�����[�V�����f���ő�^�D���猩�n���Ă���悤�ȋ^���̌������Ȃ���A�C�̈��S���w�Ԃ��Ƃ��ł��܂��B,,JR��i�`�w���k��1��,,,�֖�C���炢�Ԋ�,093-322-5002,,,,,
401005,0000000023,������,�k��B�s,�l�͎ԁi���т����֖�j,�W�����L�V���i�G�r�X���J�������j,,,�������k��B�s��i��{��3-20,,,,���ΐ��؋��y��,09:00,17:00,�I�����Ԃ͋G�߂ɂ��قȂ�k�x�l�Ȃ�,,"1�l�l3,000�~�`/1�q�A2�l�l4,000�~/1�q",��i�`���g���n�������l�͎Ԃ�JR��i�`�w�O�A�`�n�E�X�O�ȂǊe���ŏ�邱�Ƃ��ł��܂��B,,,,,���т����֖�X,093-332-4444,,,,,
401005,0000000024,������,�k��B�s,�߂�����W�]��,���J���_�C�j�e���{�E�_�C,,,�������k��B�s��i���i,,,,���ΐ��؋��y��,,,,,,�֖�C������]�ł�����W�]�䂩��́A��i�`�s�X���牺�֎s�X�܂ł̑�p�m���}���L����܂��B�����͂������A���C�g�A�b�v�����֖勴��s�X�n�̓��肪�ʂ��i���i�ʂł��B,,JR��i�`�w���^�N�V�[��10��,,,,,,,,,
401005,0000000025,������,�k��B�s,�m�[�t�H�[�N�L��,�m�[�t�H�[�N�q���o,,,�������k��B�s��i�拌��i2-5,,,,���ΐ��؋��y��,,,,,,�k��B�s�̎o���s�s�A�A�����J�E�o�[�W�j�A�B�m�[�t�H�[�N�s�ɂ��Ȃ�Ŗ�������܂����B�ڂ̑O�ɂ֖͊�C�����L����A�s�������D�𒭂߂Ċy���߂܂��B,,JR��i�`�w���a�z���s���o�X�Ŗ�10��,,,,,,,,,
401005,0000000026,������,�k��B�s,�a�z���_��,���J���W���W��,,,�������k��B�s��i��厚��i3492,,,,,,,,,,����200�N�i�����V�c9�j�ɑn�����ꂽ�Ƃ������B�Ŗk�̐_�Ђł��B�d�m�Y�̍���O��A���ƈ�傪�Ō�̉����J�����Ƃ�������A���w�薳�`�����������Ɏw�肳��Ă���u�a�z���_���v���L���ł��B,,JR��i�`�w���a�z���s���o�X�Ŗ�11���A�a�z���_�БO���Ԃ���,,,B��A��i�`,093-321-4151,,,,,
401005,0000000027,������,�k��B�s,����]�A������,�V���m�G�V���N�u�c�R�E�G��,,,�������k��B�s��i�攒��]�񒚖�7-18,,,,�����؋��y��,09:00,17:00,�k�x�l���T�Ηj���i�j���̏ꍇ�͗����j�A�N���N�n��2�`6���A9�`11���͖����J��,200�~,���200�~�A�����w��100�~���k��B�s�A�����s�A���֎s�A�F�{�s�A�������s�ݏZ��65�Έȏ�̕��͓��������i�Z���A�����A�N��ؖ��ł�����̂�񎦁j,���h���ՂޕW��110m�̋u�˂̈�p�A�ʐϖ�7.5ha�̍L��Ȍ����B���~�W�̐X��G�߂̑��Ԃ��ʂ�G���A�ȂǁA�l�G�܁X�̖L���Ȏ��R���y���ނ��Ƃ��o���܂��B���ɍ��̖����Ƃ��Ēm���Ă���A�t�ɂ͖�60�i��800�{���炫�ւ�܂��B����400�N�́u����]�m�T�g�U�N���v�͕������V�R�L�O���Ɏw�肳��Ă���A4����{�Ɍ������}���܂��B,,JR��i�`�w���o�X�Ŗ�20���u����]2���ځv���ԁA�k��2��,,,,093-341-8111,,,,,
401005,0000000028,������,�k��B�s,�֖�g���l���l��,�J�������g���l���W���h�E,,,�������k��B�s��i���i,,,,���ΐ��؋��y��,06:00,22:00,�k�x�l�Ȃ�,����,�k�������A���]�ԁE���t20�~,1958�N�i���a33�j�ɊJ�ʂ����A�����ł͒������C��l���g���l���ł��B�S����780���̃g���l���͕����ƑΊ݂܂Ŗ�15���B�������ƎR�����Ƃ̌����͎B�e�X�|�b�g�Ƃ��Đl�C������܂��B,,JR��i�`�w���o�X�Ŗ�13���A�֖�g���l���l�������ԓk������,,,B��A��i�`,093-321-4151,,,,,
401005,0000000029,������,�k��B�s,�ԊԐ_�{,�A�J�}�W���O�E,,,�R�������֎s����Ɏ���4-1,,,,,,,,,,�����̌��킪�s��ꂽ�d�m�Y��]�ލ���ɂ���A�������̑��ł�������V�c���J���Ă��܂��B�g�Ԃɏ����������V�c�͗��{�ɋA�����Ƃ������ɂ̂��Ƃ��āA�O��͗��{����ł��B,,JR���։w���o�X��10���A�u�ԊԐ_�{�O�v���Ԃ���,,,�ԊԐ_�{,083-231-4138,,,,,
401005,0000000030,������,�k��B�s,���ˎs��,�J���g�C�`�o,,,�R�������֎s���˒�5-50,,,,,05:00,15:00,�k�x�l�s��A�N�n�Ƃ��~�x�݂͗v�⍇��5�F00�`15�F00���i�X�܂ɂ��قȂ�j���E�j8�F00�`15�F00�y���H�C�x���g�z���E�y10�F00�`15�F00�A���E�j8�F00�`15�F00�������J�ÂȂ�,,,��ʋq�ł����������ł��鉵���s��Ƃ��ē�����Ă��܂��B�V�N�ȋ�����킦��H���̂ق��A����ɂ֖͊�C������]�ł���Ő��L�ꂪ����܂��B,,JR���։w���o�X��7���u���ˁv���ԁA�k��3��,,,���ˎs��,083-231-0001,,,,,
401005,0000000031,������,�k��B�s,�����։p���̎���,�L���E�V���m�Z�L�G�C�R�N�����E�W�J��,,,�R�������֎s���˒�4-11,,,,�����؋��y��,09:00,17:00,9�F00�`17�F00�i�{��1�K�j�A9�F00�`22�F00(�{��1�K�ȊO)�k�x�l���T�Ηj���i�j���̏ꍇ�J�فj,,,1906�N�i����39�N�j�Ɍ��݂��ꂽ�A�����ŌÂ̗̎��ٌ��z���ł���A���̏d�v�������Ɏw�肳��Ă��錚���ł��B�ԗ����Ɣ����΍ނ̑Δ䂪�������O�ςŁA�{�قP�K�͓W���X�y�[�X�A2�K�͋i���E�p�u�A�������͑ݏo�M�������[�Ƃ��ė��p����Ă��܂��B,,JR���։w���o�X�Ŗ�7���A�u���˃o�X��v���ԁA�k����2��,,,�����։p���̎���,083-235-1906,,,,,
401005,0000000032,������,�k��B�s,���֎s�������̂��������يC����,�V���m�Z�L�V���c�V���m�Z�L�X�C�]�N�J���J�C�L���E�J��,,,�R�������֎s���邩�ہ[��6��1,,,,���ΐ��؋��y��,09:30,17:30,�k�x�l�Ȃ��ŏI����17�F00�ɖZ���͎��ԕύX����,"2,000�~","��l2,000�~�A�����w��900�~�A�c��3�Έȏ�400�~","��550��A35,000�_�̐�������W�����Ă��܂��B�֖�C�����o�b�N�ɃC���J�ƃA�V�J����������u�A�N�A�V�A�^�[�v�͗Տꊴ�����Ղ�B���֎��ӂ̊C�ɂ���������X�i�����␢�E���̃t�O�̒���100��ވȏ���펞�W������Ȃǉ��ւ̓��F�𐶂������W�������ǂ���B",,JR���։w���o�X��5���u�C���ّO�v���ԁA�k��2��,,,�s�������̂��������فu�C���فv,083-228-1100,,,,,
401005,0000000033,������,�k��B�s,�͂��I������Ɖ���,�n�C�I�J���b�g���R�`���E,,,�R�������֎s���邩�ہ[��1��40,,,,���Ζ؋��y��,11:00,18:00,�k�x�l���j���y�����z11�F00�`18�F00�y�y���j�z10�F00�`18�F00�i21�F00�j�������ɂ��قȂ�,���������e�A�g���N�V�����L��,,�n��60m����֖̊�G���A�̌i�F���y���߂��ϗ��Ԃ��͂��߁A�C���e�[�}�Ƃ����A�g���N�V������t�@�~���[�Ŋy���߂�A�g���N�V������12��B��l���珬�������q�l�܂Ŋy�߂܂��B��̓��C�g�A�b�v������܂��B,,JR���։w���o�X��5���u�C���ّO�v���ԁA�k��2��,,,��z���Ɗ������,083-229-2300,,,,,
401005,0000000034,������,�k��B�s,�߂��蒪���s��,���J���V�I�J�[�C�`�o,,,�������k��B�s��i���i3491-16,,,,,10:00,17:00,�k�x�l�s��,,,�֖�C�����s�������D�𒭂߂Ȃ���J���������ԂŁA�~��̓J�L�����Ƃ��ĉc�Ƃ��Ă��܂��B�܂��A�����o�[�x�L���[�{�݂Ƃ��Ă����p�ł��܂��i�v�\��j�B,,�k��B��s���g�����C���u�������v�֖�C���߂���w���k��1��,,,����,093-332-7100,,,,,
401005,0000000035,������,�k��B�s,�ϒ��V����,�J���`���E���E�z�h�E,,,�������k��B�s��i�拌��i2,,,,,,,,,,�֖�C���̒����ԋ߂Ɋ�������A�m�[�t�H�[�N�L�ꂩ�璪���L����ӂ܂ő����V�����ł��B�}������������A�֖�C�����܂����Y��Ȋ֖勴����]���邱�Ƃ��ł��܂��B,,JR��i�`�w���a�z���s���o�X�Ŗ�10���A�a�z�������O���Ԃ���,,,,,,,,,
401005,0000000036,������,�k��B�s,���E���a�p�S�_,�Z�J�C�w�C���p�S�_,,,�������k��B�s��i��厚��i3251-4,,,,,,,,,,���{�ŗB��̃r���}�����@�B��񎟐��E����ɐ��E���a�Ɛ�v�҂̈ԗ�̂��߂ɁA�r���}���{������Ɠ��{�̗L�u�ɂ���Č����B������27m�A���a13m�̉~���`�̎��@�̓����ɂ́A�����������������_�C�������h�E�s�i�N���i�듃���j���ݒu�B,,JR��i�`�w���^�N�V�[��6��,,,���E���a�p�S�_,093-321-1033,,,,,
401005,0000000037,������,�k��B�s,���q��,�R�N���W���E,,,�������k��B�s���q�k����2-1,,,,���ΐ��؋��y��,09:00,18:00,9�F00�`18�F00(4���`10��)9�F00�`17�F00(11���`3��)����͕��30���O�܂�,350�~,��l350�~�A������200�~�A���w��100�~,1602�N�i�c��7�j�A�א쒉��������7�N�̍Ό����o�Ēz�邵�����q�̃V���{���B5�K���S�K���傫���u������v�̓V��t��A�ؐ΂��g��Ȃ��u��ʐς݁v�̍����ȐΊ_�������ł��B�i����30�N�Ă���H���ɂ��x�ٗ\��j,,JR���q�w���k��15��,,,���q��,093-561-1210,,,,,
401005,0000000038,������,�k��B�s,���q��뉀,�R�N���W���E�e�C�G��,,,�������k��B�s���q�k����1-2,,,,���ΐ��؋��y��,09:00,18:00,9�F00�`18�F00(4���`10��)9�F00�`17�F00(11���`3��)����͕��30���O�܂�,300�~,��l300�~�A������150�~�A���w��100�~,�]�ˎ���̑喼�̒뉀�ƕ��Ƃ̏��@�Ȃǂ��A���q���̉����~�ՂɍČ����܂����B�u�a�v�̐��_�Ɋ�Â������K���Ɋւ���W���ϗ���A�����₨�َq�̑̌��ȂǁA���{�̗�@��`���I�Ȑ����������w�Ԃ��Ƃ��ł��܂��B,,JR���q�w���k��15��,,,���q��뉀,093-582-2747,,,,,
401005,0000000039,������,�k��B�s,���{�����L�O��,�}�c���g�Z�C�`���E�L�l���J��,,,�������k��B�s���q�k����2-3,,,,���ΐ��؋��y��,09:30,18:00,���ق�17�F30�܂Łk�x�l12/29�`31,500�~,��l500�~�A������300�~�A���w��200�~,�u�_�Ɛ��v�u���̊�v�Ȃǂ̑�\������k��B�s�o�g�̍�ƁE���{�����̋Ɛт�`������{�B��̋L�O�قł��B�����ɍČ����ꂽ�����̎d�������⎑���A��i�Ȃǂ�W�����Ă��܂��B,,JR�����q�w���k��8��,,,���{�����L�O��,093-582-2761,,,,,
401005,0000000040,������,�k��B�s,�k��B�s�����w��,�L�^�L���E�V���E�V���c�u���K�N�J��,,,�������k��B�s�����q�k����4-1,,,,�ΐ��؋��y��,09:30,18:00,���ق͕�30���O�܂Łk�x�l���j�i�j���̏ꍇ�͗����j,200�~,��l200�~�A������100�~�A���w��50�~�i���ʊ��W�͕ʗ����j,�X?�O�A�ѕ����q�A�Ζ숯���A���c�v���Ȃǖk��B�s�ɂ䂩��̂��镶�w�҂��e�[�}�Ƃ��A1�K�͊��W�����A2�K�͖����ȍ~�̖k��B���|�Ɋւ����ݓW����������܂��B,,JR�����q�w���k��10��,,,�k��B�s�����w��,093-571-1505,,,,,
401005,0000000041,������,�k��B�s,���Â̐X����,�C�g�E�d�m�����R�E�G��,,,�������k��B�s���q�k��㓞�Îl����1-8,,,,���ΐ��؋��y��,09:00,17:00,�k�x�l�Ηj(�j���̏ꍇ�͗���)�A�N���N�n�A4�E5�E8���͖��x��ԊJ�����͉���,800�~,��l800�~�A������400�~�A4�ˁ`���w��100�~,�]�E��L�����Ȃǖ�100��̓����ɏo������s�S�ɋ߂����������ł��B�ϗ��ԂȂǂ̗V��{�݂�Ő��L��A�ӂꂠ���������G���A������A�Ƒ��A��ɐl�C�B,,JR���q�w���獕��s���o�X�Ŗ�20���A���Â̐X�����O���Ԃ���,,,���Â̐X����,093-651-1895,,,,,
401005,0000000042,������,�k��B�s,�k��B���w�T����,�L�^�L���E�V���E�u���K�N�T����,,,�������k��B�s���q�k�拞���꒚��5-9�r��1�K�i������V�X���j,,,,���ΐ��؋��y��,11:00,18:00,�k�x�l�N���N�n�ؗj���̂�21�F00�܂�,����,,�s���ŊJ�Â���镶����񂪓���ł��A�{�s�䂩��̍�Ƃ̏Љ�R�[�i�[��Ǐ��X�y�[�X������܂��B���q�̊X�̂Ȃ��U��̐܂ɂ��C�y�ɗ������܂��B,,JR���q�w���q������k��8��,,,�k��B���w�T����,093-383-8610,,,,,
401005,0000000043,������,�k��B�s,���o�[�E�H�[�N�k��B,���o�[�E�H�[�N�L�^�L���E�V���E,,,�������k��B�s���q�k�掺���꒚��1-1,,,,���ΐ��؋��y��,10:00,21:00,�V���b�v�E10�F00�`21�F00�A���X�g�����E11�F00�`23�F00�A�A�~���[�Y�����g�E10�F00�`24�F00���c�Ǝ��Ԃ͈ꕔ�X�܂ɂ��قȂ�,,,���L�����オ�W�܂镡���{�݂Ƃ��āA���X�g�����⌀��A�f��ق�����A�V���b�s���O�A�O�����A�|�p�ӏ܂Ɨl�X�Ȋy���ݕ����ł���̂����͂ł��B���C�u��C�x���g�Ȃǂ����{���Ă��܂��B,,JR�����q�w���k��3��,,,���o�[�E�H�[�N�k��B���T�[�r�X�Z���^�[,093-573-1500,,,,,
401005,0000000044,������,�k��B�s,�[�������n�}�̎�����,�[�������`�Y�m�V�����E�J��,,,�������k��B�s���q�k�掺���꒚��1-1���o�[�E�H�[�N�k��B14F,,,,���ΐ��؋�,10:00,17:00,�k�x�l�y�j�E���j�A�N���N�n�A�Ċ��x�Ɠ��i���ق�16:30�܂Łj,100�~,��l100�~�A���w���ȉ�����,��B���ʂ̏o���n�_�ł���u��Ջ��v�̋߂��ɂ���A�ɔ\���h�̑��ʑ���������u����{���C���n�S�}�i���������j�v�Ȃǂ̓W����̌��R�[�i�[������܂��B,,JR���q�w���k��10���AJR�����q�w���k��5��,,,�[�������n�}�̎�����,093-592-9082,,,,,
401005,0000000045,������,�k��B�s,�U�ߎs��,�^���K�C�`�o,,,�������k��B�s���q�k�招���l����,,,,,,,�X�܂ɂ��قȂ�,,,�吳���ゲ�납��n�܂����Ƃ����A���݂ł͖k��B�̑䏊�Ƃ��āA��120���̓X������A�˂܂��B�n���Y�̐V�N�Ȑʂ�N���A����̂��y�؂̂ق��A�n���̓`���H�u�ʂ������v�Ȃǂ��������ƕ���ł��܂��B�s����ɂ����{���ł́A�I���W�i�����������オ��܂��B,,JR���q�w���k��10��,,,�U�ߎs�ꎖ����,093-521-4140,,,,,
401005,0000000046,������,�k��B�s,�k��B�s����~���[�W�A��,�L�^�L���E�V���E�V�}���K�~���[�W�A��,,,�������k��B�s���q�k����񒚖�14-5���邠��city5�K�A6�K,,,,�����؋��y��,11:00,19:00,�k�x�l�Ηj(�j���̏ꍇ�͗���)�A�N���N�n�A�ٓ����������ق�18�F30�܂�,400�~,��l400�~�A������200�~�A���w��100�~�A���w����������,�u����E�ǂށE�`���v���e�[�}�ɖ��敶�����y�����Љ�܂��B�n���䂩��̖���Ƃ̍�i�W���̂ق��A����̗��j��d�g�݂ɂ��ĉ������R�[�i�[�A��5�����̖�������R�ɉ{���ł���R�[�i�[������܂��B�T���ɂ͏��S�Ҍ����̖��拳�����J�Â��Ă��܂��B,,JR���q�w�i�V�������j����E������֓k��2��,,,�k��B�s����~���[�W�A��,093-512-5077,,,,,
401005,0000000047,������,�k��B�s,���邠��City,�A���A���V�e�B,,,�������k��B�s���q�k����񒚖�14-5,,,,���ΐ��؋��y��,11:00,20:00,�k�x�l�Ȃ��c�Ǝ��Ԃ͈ꕔ�X�܂ɂ��قȂ�,����,�ꕔ�L���{�݂���,�A�j���E����E�Q�[���E�A�C�h���E�R�X�v���Ȃǃ|�b�v�J���`���[�̃R���e���c�����������Ǝ{�݂ł��B�X�ɃC�x���g�z�[��������A���T�y�����C�x���g���J�Â���Ă��܂��B,,JR���q�w�i�V�������j����E������֓k��2��,,,���邠��City,093-512-9566,,,,,
401005,0000000048,������,�k��B�s,�X?�O����,�����I�E�K�C�L���E�L��,,,�������k��B�s���q�k��b�����꒚��7-2,,,,�ΐ��؋��y��,10:00,16:30,�k�x�l���j�i�j���̏ꍇ�͗������x�فj�A�j���A�N���N�n,����,,�����u���P�v�ȂǂŒm����X?�O���A�����R��12�t�c�R�㕔���Ƃ��ĕ��C�����ۂ�1�N����炵���Z���ł��B1974�N(���a49)�A�s�������Ɏw�肳��܂����B,,JR���q�w���k��10��,,,�X?�O����,093-531-1604,,,,,
401005,0000000049,������,�k��B�s,TOTO�~���[�W�A��,�g�[�g�[�~���[�W�A��,,,�������k��B�s���q�k�撆��2-1-1,,,,�ΐ��؋��y��,10:00,17:00,���ق�16�F30�܂Łk�x�l���j�E�N���N�n�E�ċG�x�ɒc�̗v�\��i20���ȏ�j,����,,���{�̋ߑ㉻�̈ꗃ��S����TOTO�n�Ƃ̃��[�c�Ɨ��j���Љ�Ă��܂��B�n�������50�N�ɂ킽��ATOTO���x���Ă����H���W�����Ă���ق��A���ゲ�Ƃ̐��i�̐i����`���A���j��ς��Ă�����\�I�ȉq������E��������E�E�H�V�����b�g���͂��߁A�����Ȍ���ɐݒu����Ă����M�d�Ȑ��i���W�����Ă��܂��B,,JR���q�w���o�X�Łu�M�D���o�X��v���ԁAJR���q�w���Ԃ�10��,,,TOTO�~���[�W�A��,093-951-2534,,,,,
401005,0000000050,������,�k��B�s,�R�c�Βn,���}�_�����N�`,,,�������k��B�s���q�k��R�c��,,,,�����؋��y��,09:00,17:00,�k�x�l�Ηj�i�j���̏ꍇ�͗����j,�����������i���ԗ��ʓr��300�~�A���E��^1000�~�j,,�u30���I�̐X�Â���v���e�[�}�B�n�蒹�������ώ@���邱�Ƃ��ł��A���O�n�E�X���Ő��L�������܂��B,,JR���q�w����25���A���������o�X�≺�ԓk��10���i�y���j���̂݁A�R�c�Βn�o�X�≺�ԓk��1���j,,,�R�c�Βn�Ǘ�������,093-582-4870,,,,,
401005,0000000051,������,�k��B�s,����R����,�^���P���}�R�E�G��,,,�������k��B�s���q�k��ԍ�4,,,,,,,,,,�֖�C���ɕ����Ԋޗ��������]�ł�������ł��B�{�{�����̗{�q���u�����̔�v�������B���ׂ̗Ɂu�����Y�̔�v����������܂����B,,JR���q�w�����i���ʍs���o�X��10���A����R����,,,,,,,,,
401005,0000000052,������,�k��B�s,�~�N�j���[���h�X�^�W�A���k��B,�~�N�j���[���h�X�^�W�A���L�^�L���E�V���E,,,�������k��B�s���q�k����O����9-33,,,,,,,,,,"�~�N�j���[���h�X�^�W�A���k��B�i�k��B�X�^�W�A���j�́A�u�C�����E�X�Ȃ��v�X�^�W�A���Ƃ���2017�N3���ɃO�����h�I�[�v�����܂����B�ϋq�Ȑ���15,300�ȁA�őO��̐Ȃ��^�b�`���C���E�S�[�����C���܂ł̋����͂킸���W���B�Տꊴ���ӂ��_�C�i�~�b�N�X�^�W�A���ł��B",,JR���q�w���k��7��,,,�~�N�j���[���h�X�^�W�A���k��B,093-521-2020,,,,,
401005,0000000053,������,�k��B�s,�k��B���f�B�A�h�[��,�L�^�L���E�V���E���f�B�A�h�[��,,,�������k��B�s���q�k��O����O����1-1,,,,,,,�C�x���g�ɂ��قȂ�,,�C�x���g�ɂ��قȂ�,���{�ōŏ��ɂł������֏�u���q���֏�v���܂ށA��^�����{�݁B�A���[�i�̓R���T�[�g��^����A�X�|�[�c���Ȃǂɗ��p����Ă���A���͂ɂ͎Ő��L���V��������A�s�N�j�b�N������Ƒ��A��⃉���j���O���y���ސl�����ł���������Ă��܂��B,,�k��B���m���[�����t���O����w���k����10��,,,�k��B���f�B�A�h�[��,093-931-7337,,,,,
401005,0000000054,������,�k��B�s,������,�q���I�_�C,,,�������k��B�s���q��敽����,,,,,,,,,,���̓V�R�L�O���Ɏw�肳�ꂽ���{�O��J���X�g�̈�ł��B�t�̖�Ă��A�Ă̐V�΁A�H�̃X�X�L��ȂǒʔN�Ŋy���߂܂��B�W��400�`600m�̍����ɂ͖����̐ΊD�⒌���ї��A�܂�ŗr�̌Q��̂悤�Ɍ����܂��B�Ȃ��ɂ́u�L�X��v��u���C�I����v�Ƃ��������j�[�N�Ȏp���������A�ΊD��̒�����o�Ă����u�Ǎ����؁v�Ȃǎ��R���D��Ȃ���ȕ��i�����邱�Ƃ��ł��܂��B,,,,,,,,,,,
401005,0000000055,������,�k��B�s,�����䎩�R�̋�,�q���I�_�C�V�[���m�T�g,,,�������k��B�s���q��敽����꒚��1-1,,,,�����؋��y��,09:00,17:00,�k�x�l�Ηj�A�N���N�n�i1/1�͏����o��j�����Ԃ͋G�߂ɂ��قȂ�,����,,������̗Y��ȕ��i����]�o�����^�����ŁA���Αł��ⓩ�|�ȂǑ��ʂȑ̌����j���[���͂��߁A�V��L���H�����Ȃǈ�����y���߂�ݔ����[���B�G�߂��ƂɃC�x���g�Ȃǂ��s���Ă��܂��B,,JR�Ό����w���^�N�V�[�Ŗ�15��,,,�����䎩�R�̋�,093-452-2715,,,,,
401005,0000000056,������,�k��B�s,�����䎩�R�ώ@�Z���^�[,�q���I�_�C�V�[���J���T�c�Z���^�[,,,�������k��B�s���q��敽����꒚��4-40,,,,�ΐ��؋��y��,09:00,17:00,�k�x�l���j�i�x���̏ꍇ�����j�A�N���N�n���ċx�݊��Ԃ͂Ȃ�,����,,�ߓ����̂ł�����A������ɐ������铮�A���̐��ԂȂǂ��p�l����͌^�����Ȃ���y�����w�ׁA�J���X�g��n�ɂ��ďЉ�鎑���فB�n�C�L���O�O�Ȃǂɗ�����ď��W�߂Ȃǂɗ��p���悤�I,,JR�Ό����w���^�N�V�[�Ŗ�15��,,,�����䎩�R�ώ@�Z���^�[,093-453-3737,,,,,
401005,0000000057,������,�k��B�s,�畧�ߓ���,�Z���u�c�V���E�j���E�h�E,,,�������k��B�s���q��敽����O����2-1,,,,���ΐ��؋��y��,09:00,17:00,�k�x�l�Ȃ��i�����j9:00�`17:00�i�y���j�j9:00�`18:00,800�~,��l800�~�A���Z��600�~�A���w��500�~�A���w��400�~,���̓V�R�L�O���Ɏw�肳��A�ό����͑S��1.2�q�ŁA�����ɂ͖�20�̌��ǂ��낪����܂��B�S���ł��������ߓ����œr�����琅��14���̐��̒�������܂��B,,JR�Ό����w���^�N�V�[�Ŗ�20��,,,�畧�ߓ���,093-451-0368,,,,,
401005,0000000058,������,�k��B�s,�ڔ��ߓ���,���W���V���E�j���E�h�E,,,�������k��B�s���q���O����1-1,,,,,10:00,17:00,�k�x�l�s��x,500�~,��l500�~�A���l�i���w���ȉ��j250�~,�_�C�i�~�b�N�ȉ����ƈꖇ�V�䂪�����B�K�C�h�t���̃P�C�r���O�A�L�����v��o�[�x�L���[���ł��܂��B,,JR�Ό����w���^�N�V�[�Ŗ�20��,,,�ڔ��ߓ����i�����ē��j,093-451-6315,,,,,
401005,0000000059,������,�k��B�s,�����ߓ���,�I�W�J�V���E�j���E�h�E,,,�������k��B�s���q��敽����,,,,,10:00,17:00,�k�x�l�s��x�i�����j10:00�`17:00�i�y���j�j10:00�`18:00,500�~,���w���ȏ�500�~�A���w��300�~,���{�ł͒����������^�̊ό��ߓ����ŁA����ɂ̓J���E�\��i�E�}���ۂ̍����������ꂽ�b���a������܂��B�ό����̉��Ō�����R�o���g�u���[�̐���͐_��I�ł��B,,JR�Ό����w���^�N�V�[�Ŗ�15��,,,�����ߓ���,093-451-0165,,,,,
401005,0000000060,������,�k��B�s,�����̑�,�X�K�I�m�^�L,,,�������k��B�s���q���厚����,,,,,,,,,,����̏㗬�ɂ���A��m�ꂩ��O�m��܂ŎO�i�ɕ�����A��m�ꂪ�ł��傫�������͖�30m�ŁA�k��B�s�ł͍ő�B�Ă͐����Ԃ����S�n�悭�A�Ƒ��A��Ȃǂœ�����Ă��܂��B,,���ł�����ʁu�����v�o�X�₩��k��50��,,,,,,,,,
401005,0000000061,������,�k��B�s,�]������,�\�l�q�K�^,,,�������k��B�s���q���厚�]���`�]���V�c,,,,,,,,,,���q���̊C�݂ɍL���銱���ŁA�ʐς�517ha�Ɩk��B�s�ő�B�쒹���͂��߃J�u�g�K�j�Ȃǂ��������Ă���A���E�I�ɂ��������Ȃ��Ȃ��Ă���u�Y�O���J�����v�̍����L���̉z�~�n�ɂ��Ȃ��Ă��܂��B,,�]���V�c�o�X����k��15��,,,,,,,,,
401005,0000000062,������,�k��B�s,�k��B�s�������_���Z���^�[,�L�^�L���E�V���E�V���c�\�E�S�E�m�E�W�Z���^�[,,,�������k��B�s���q��扡�㓌���꒚��6-1,,,,���ΐ��؋��y��,09:00,16:30,�k�x�l�N���N�n,����,,�Y���s��̃��j���[�A���A�V�݂̖�OBBQ��y�H�R�[�i�[�ł͒n�Y�n���̃��j���[��񋟁A����Ƀ|�j�[��n��J�s�o���A�E�T�M�̂ӂꂠ�����o���܂��B�Ő��L��A��80�i��2000�����ւ�o������~���Ȃǎl�G�܁X�̉Ԃ��y���߂�����ł��B,,�o�X��u�_���Z���^�[�O�v���Ԃ���,,,�k��B�s�������_���Z���^�[,093-961-6045,,,,,